ANIMATION RURALE
related: ANIMATION
type: Concept

ANIMATION
type: Concept
definition: Méthode active dont l'essentiel consiste à remplacer l'information directe de type magistral par l'éveil et l'utilisation de l'énergie du groupe
hidden label: sensibilisation
in scheme: vochorizon
related: ANIMATION RURALE
top concept of: vochorizon

vochorizon
type: Ontology
type: ConceptScheme