TRAITEMENT D'IMAGE
related: ANALYSE D'IMAGE
type: Concept

ANALYSE D'IMAGE
type: Concept
definition: Décomposition de l'image en ses éléments constitutifs en vue d'un traitement ultérieur
in scheme: vochorizon
related: TRAITEMENT D'IMAGE
top concept of: vochorizon

vochorizon
type: Ontology
type: ConceptScheme