FECONDITE
type: Concept
definition: "A associer à d'autres descripteurs, ce terme étant utilisé en Biologie ou en Démographie"
in scheme: vochorizon
top concept of: vochorizon

vochorizon
type: Ontology
type: ConceptScheme