BALANCE COMMERCIALE
type: Concept
definition: Elément de la balance des paiements. Récapitulation des échanges de biens et services qui constituent l'essentiel des transactions économiques d'un pays avec l'étranger (échanges extérieurs)
in scheme: vochorizon
top concept of: vochorizon

vochorizon
type: Ontology
type: ConceptScheme