IMAGE NUMERIQUE
type: Concept
definition: Image potentielle dont les éléments sont constitués par des données numériques ou topologiques
in scheme: vochorizon
top concept of: vochorizon

vochorizon
type: Ontology
type: ConceptScheme