MATIERE ORGANIQUE
type: Concept
related: HUMUS

HUMUS
type: Concept
definition: Ensemble des produits d'altération ou en voie d'altération de la matière organique du sol
in scheme: vochorizon
related: MATIERE ORGANIQUE
top concept of: vochorizon

vochorizon
type: Ontology
type: ConceptScheme