PRETRAITEMENT D'IMAGE
type: Concept
related: AMELIORATION D'IMAGE

AMELIORATION D'IMAGE
type: Concept
definition: Action de rendre plus appropriées la qualité et la fidélité d'une image en vue d'une étude particulière
hidden label: accentuation d'image
in scheme: vochorizon
related: PRETRAITEMENT D'IMAGE
top concept of: vochorizon

vochorizon
type: Ontology
type: ConceptScheme