NIVEAU TROPHIQUE
type: Concept
related: ECOSYSTEME

ECOSYSTEME
type: Concept
definition: Association d'un environnement physicochimique spécifique (écotope) et d'une communauté vivante (biocénose)
in scheme: vochorizon
related: NIVEAU TROPHIQUE
top concept of: vochorizon

vochorizon
type: Ontology
type: ConceptScheme