vochorizon
type: Ontology
type: ConceptScheme

NEUSTON
type: Concept
definition: "Ensemble des organismes dont la biologie dépend directement de l'interface air eau et, en particulier, du film de matière organique caractéristique de cette interface"
in scheme: vochorizon
top concept of: vochorizon