vochorizon
type: Ontology
type: ConceptScheme

HAUTEUR DYNAMIQUE
type: Concept
definition: "Différence de géopentiel, exprimée en mètre dynamique entre un niveau de référence et le point considéré"
in scheme: vochorizon
top concept of: vochorizon