vochorizon
type: Ontology
type: ConceptScheme

DISPERSION
type: Concept
definition: "Séparation des composantes spectrales d'un rayonnement éléctromagnétique au moyen d'un appareil (prisme, réseau) ou sous l'effet de phénomènes naturels"
in scheme: vochorizon
top concept of: vochorizon