vochorizon
type: Ontology
type: ConceptScheme

DEPENDANCE ECONOMIQUE
type: Concept
definition: Etat dont l'économie subit les conséquences des mouvements et des politiques émanant d'autres pays
in scheme: vochorizon
top concept of: vochorizon